TUM-DSE/doctor-cluster-config build #260 failed ← #259 #261 →
eval warnings
1 kind
· 2 occurrences
- warn `boot.zfs.forceImportRoot` is using the default value of `true`. It is highly recommended to set it to `false`, the new default from 26.11 on, to reduce the risk of data loss. Alternatively, you can silence this warning by explicitly setting it to `true`. ×2
1 failed
| status | attribute | duration |
|---|---|---|
checks.x86_64-linux.nixos-clara
|
1m 15s | |
coyote-driver-0-unstable-9c00353-7.1.8: compilation terminated. make[4]: *** [/nix/store/55hy1wb8mssl6rd7x6snyx3df0i6j4ky-linux-7.1.8-dev/lib/modules/7.1.8/sour …coyote-driver-0-unstable-9c00353-7.1.8: compilation terminated. make[4]: *** [/nix/store/55hy1wb8mssl6rd7x6snyx3df0i6j4ky-linux-7.1.8-dev/lib/modules/7.1.8/source/scripts/Makefile.build:289: src/vfpga/vfpga_isr.o] Error 1 make[3]: *** [/nix/store/55hy1wb8mssl6rd7x6snyx3df0i6j4ky-linux-7.1.8-dev/lib/modules/7.1.8/source/Makefile:2165: .] Error 2 make[2]: *** [/nix/store/55hy1wb8mssl6rd7x6snyx3df0i6j4ky-linux-7.1.8-dev/lib/modules/7.1.8/source/Makefile:248: __sub-make] Error 2 make[2]: Leaving directory '/build/driver/build' make[1]: *** [/nix/store/55hy1wb8mssl6rd7x6snyx3df0i6j4ky-linux-7.1.8-dev/lib/modules/7.1.8/source/Makefile:248: __sub-make] Error 2 make[1]: Leaving directory '/nix/store/55hy1wb8mssl6rd7x6snyx3df0i6j4ky-linux-7.1.8-dev/lib/modules/7.1.8/build' make: *** [Makefile:68: all] Error 2 |
||
32 succeeded
| status | attribute | duration |
|---|---|---|
| loading… | ||
9 already built
| status | attribute | duration |
|---|---|---|
| loading… | ||