nixbot

builds

TUM-DSE/focaccia-eval build #2 failed

branch main · commit 898bfe3fc1 · · took 10m 33s

21 failed
failed attributes
status attribute duration
failed checks.aarch64-linux.aarch64-generated-control-plugin-routing 0s
aarch64-generated-control-plugin-routing: File "/build/evaluation/test_aarch64_reproducer_evaluation.py", line 13, in <module> from aarch64_reproducer_eva …
aarch64-generated-control-plugin-routing:
  File "/build/evaluation/test_aarch64_reproducer_evaluation.py", line 13, in <module>
    from aarch64_reproducer_evaluation import (
  File "/build/evaluation/aarch64_reproducer_evaluation.py", line 19, in <module>
    from focaccia.completion import TraceCompletion, TraceScope
ModuleNotFoundError: No module named 'focaccia.completion'
----------------------------------------------------------------------
Ran 1 test in 0.000s
FAILED (errors=1)
failed checks.aarch64-linux.aarch64-reproducer-concrete-dependencies 0s
aarch64-reproducer-concrete-dependencies: File "/build/evaluation/test_aarch64_reproducer_evaluation.py", line 13, in <module> from aarch64_reproducer_eva …
aarch64-reproducer-concrete-dependencies:
  File "/build/evaluation/test_aarch64_reproducer_evaluation.py", line 13, in <module>
    from aarch64_reproducer_evaluation import (
  File "/build/evaluation/aarch64_reproducer_evaluation.py", line 19, in <module>
    from focaccia.completion import TraceCompletion, TraceScope
ModuleNotFoundError: No module named 'focaccia.completion'
----------------------------------------------------------------------
Ran 1 test in 0.000s
FAILED (errors=1)
failed checks.aarch64-linux.aarch64-reproducer-entry-context-admission 0s
aarch64-reproducer-entry-context-admission: module = __import__(module_name) ^^^^^^^^^^^^^^^^^^^^^^^ File "/build/evaluation/test_reproducer_ …
aarch64-reproducer-entry-context-admission:
    module = __import__(module_name)
             ^^^^^^^^^^^^^^^^^^^^^^^
  File "/build/evaluation/test_reproducer_evaluation.py", line 10, in <module>
    from focaccia.completion import TraceCompletion, TraceScope
ModuleNotFoundError: No module named 'focaccia.completion'
----------------------------------------------------------------------
Ran 1 test in 0.000s
FAILED (errors=1)
failed checks.aarch64-linux.box64-cmpxchg-validation 2s
… and 1 more failed derivation
… and 1 more failed derivation
failed checks.aarch64-linux.build-trigger-1375 0s
setup: this derivation will be built: /nix/store/w3p9ijrayjjairlcxf34li4fzryj3lsm-focaccia-reproducer-1375-x86_64-unknown-linux-musl-1.drv cannot build on 'ss …
setup:
this derivation will be built:
  /nix/store/w3p9ijrayjjairlcxf34li4fzryj3lsm-focaccia-reproducer-1375-x86_64-unknown-linux-musl-1.drv
cannot build on 'ssh-ng://buildbot-worker@eliza.dos.cit.tum.de': error: failed to start SSH connection to 'eliza.dos.cit.tum.de'
Failed to find a machine for remote build!
derivation: w3p9ijrayjjairlcxf34li4fzryj3lsm-focaccia-reproducer-1375-x86_64-unknown-linux-musl-1.drv
required (system, features): (aarch64-linux, [])
1 available machines:
(systems, maxjobs, supportedFeatures, mandatoryFeatures)
([aarch64-linux], 192, [big-parallel, kvm, nixos-test], [])
error: Cannot build '/nix/store/w3p9ijrayjjairlcxf34li4fzryj3lsm-focaccia-reproducer-1375-x86_64-unknown-linux-musl-1.drv'.
       Reason: platform mismatch
       Required system: 'aarch64-linux'
       Current system: 'x86_64-linux'
dependency failed checks.aarch64-linux.corpus-all —
failed checks.aarch64-linux.diagnostic-reproducer-source-admission 1s
diagnostic-reproducer-source-admission: module = __import__(module_name) ^^^^^^^^^^^^^^^^^^^^^^^ File "/build/evaluation/test_reproducer_eval …
diagnostic-reproducer-source-admission:
    module = __import__(module_name)
             ^^^^^^^^^^^^^^^^^^^^^^^
  File "/build/evaluation/test_reproducer_evaluation.py", line 10, in <module>
    from focaccia.completion import TraceCompletion, TraceScope
ModuleNotFoundError: No module named 'focaccia.completion'
----------------------------------------------------------------------
Ran 1 test in 0.000s
FAILED (errors=1)
failed checks.aarch64-linux.native-witness-identity 0s
setup: this derivation will be built: /nix/store/wj6y0ln09b07rfl6fgbax87qrrnqr31f-native-witness-identity.drv cannot build on 'ssh-ng://buildbot-worker@eliza. …
setup:
this derivation will be built:
  /nix/store/wj6y0ln09b07rfl6fgbax87qrrnqr31f-native-witness-identity.drv
cannot build on 'ssh-ng://buildbot-worker@eliza.dos.cit.tum.de': error: failed to start SSH connection to 'eliza.dos.cit.tum.de'
Failed to find a machine for remote build!
derivation: wj6y0ln09b07rfl6fgbax87qrrnqr31f-native-witness-identity.drv
required (system, features): (aarch64-linux, [])
1 available machines:
(systems, maxjobs, supportedFeatures, mandatoryFeatures)
([aarch64-linux], 192, [big-parallel, kvm, nixos-test], [])
error: Cannot build '/nix/store/wj6y0ln09b07rfl6fgbax87qrrnqr31f-native-witness-identity.drv'.
       Reason: platform mismatch
       Required system: 'aarch64-linux'
       Current system: 'x86_64-linux'
failed checks.aarch64-linux.plugin-reference-acceptance 0s
setup: this derivation will be built: /nix/store/qviv02jm89vmc7rhwl501114ps4wg4ki-plugin-reference-acceptance.drv cannot build on 'ssh-ng://buildbot-worker@el …
setup:
this derivation will be built:
  /nix/store/qviv02jm89vmc7rhwl501114ps4wg4ki-plugin-reference-acceptance.drv
cannot build on 'ssh-ng://buildbot-worker@eliza.dos.cit.tum.de': error: failed to start SSH connection to 'eliza.dos.cit.tum.de'
Failed to find a machine for remote build!
derivation: qviv02jm89vmc7rhwl501114ps4wg4ki-plugin-reference-acceptance.drv
required (system, features): (aarch64-linux, [])
1 available machines:
(systems, maxjobs, supportedFeatures, mandatoryFeatures)
([aarch64-linux], 192, [big-parallel, kvm, nixos-test], [])
error: Cannot build '/nix/store/qviv02jm89vmc7rhwl501114ps4wg4ki-plugin-reference-acceptance.drv'.
       Reason: platform mismatch
       Required system: 'aarch64-linux'
       Current system: 'x86_64-linux'
failed checks.aarch64-linux.reference-terminal-acceptance 0s
setup: this derivation will be built: /nix/store/ji241lnxjd03pa41agz68q6ai9lqc4l3-reference-terminal-acceptance.drv cannot build on 'ssh-ng://buildbot-worker@ …
setup:
this derivation will be built:
  /nix/store/ji241lnxjd03pa41agz68q6ai9lqc4l3-reference-terminal-acceptance.drv
cannot build on 'ssh-ng://buildbot-worker@eliza.dos.cit.tum.de': error: failed to start SSH connection to 'eliza.dos.cit.tum.de'
Failed to find a machine for remote build!
derivation: ji241lnxjd03pa41agz68q6ai9lqc4l3-reference-terminal-acceptance.drv
required (system, features): (aarch64-linux, [])
1 available machines:
(systems, maxjobs, supportedFeatures, mandatoryFeatures)
([aarch64-linux], 192, [big-parallel, kvm, nixos-test], [])
error: Cannot build '/nix/store/ji241lnxjd03pa41agz68q6ai9lqc4l3-reference-terminal-acceptance.drv'.
       Reason: platform mismatch
       Required system: 'aarch64-linux'
       Current system: 'x86_64-linux'
failed checks.aarch64-linux.reproducer-content-addressed-source-identity 5s
reproducer-effectiveness-evaluation: module = __import__(module_name) ^^^^^^^^^^^^^^^^^^^^^^^ File "/build/evaluation/test_reproducer_evaluat …
reproducer-effectiveness-evaluation:
    module = __import__(module_name)
             ^^^^^^^^^^^^^^^^^^^^^^^
  File "/build/evaluation/test_reproducer_evaluation.py", line 10, in <module>
    from focaccia.completion import TraceCompletion, TraceScope
ModuleNotFoundError: No module named 'focaccia.completion'
----------------------------------------------------------------------
Ran 1 test in 0.000s
FAILED (errors=1)
failed checks.aarch64-linux.reproducer-effectiveness-evaluation 1s
reproducer-effectiveness-evaluation: module = __import__(module_name) ^^^^^^^^^^^^^^^^^^^^^^^ File "/build/evaluation/test_reproducer_evaluat …
reproducer-effectiveness-evaluation:
    module = __import__(module_name)
             ^^^^^^^^^^^^^^^^^^^^^^^
  File "/build/evaluation/test_reproducer_evaluation.py", line 10, in <module>
    from focaccia.completion import TraceCompletion, TraceScope
ModuleNotFoundError: No module named 'focaccia.completion'
----------------------------------------------------------------------
Ran 1 test in 0.000s
FAILED (errors=1)
failed checks.aarch64-linux.reproducer-size-measurement-fidelity 0s
setup: this derivation will be built: /nix/store/siwbgq8nrz8l73faygy4dcrcffm3s52x-reproducer-size-measurement-fidelity.drv cannot build on 'ssh-ng://buildbot- …
setup:
this derivation will be built:
  /nix/store/siwbgq8nrz8l73faygy4dcrcffm3s52x-reproducer-size-measurement-fidelity.drv
cannot build on 'ssh-ng://buildbot-worker@eliza.dos.cit.tum.de': error: failed to start SSH connection to 'eliza.dos.cit.tum.de'
Failed to find a machine for remote build!
derivation: siwbgq8nrz8l73faygy4dcrcffm3s52x-reproducer-size-measurement-fidelity.drv
required (system, features): (aarch64-linux, [])
1 available machines:
(systems, maxjobs, supportedFeatures, mandatoryFeatures)
([aarch64-linux], 192, [big-parallel, kvm, nixos-test], [])
error: Cannot build '/nix/store/siwbgq8nrz8l73faygy4dcrcffm3s52x-reproducer-size-measurement-fidelity.drv'.
       Reason: platform mismatch
       Required system: 'aarch64-linux'
       Current system: 'x86_64-linux'
dependency failed checks.aarch64-linux.trigger-mismatch-witness-boundaries —
failed checks.aarch64-linux.trigger-naming 0s
setup: this derivation will be built: /nix/store/60wp1zbyrjm6zpkdsvf50azs1jkjd19y-trigger-catalog-naming.drv cannot build on 'ssh-ng://buildbot-worker@eliza.d …
setup:
this derivation will be built:
  /nix/store/60wp1zbyrjm6zpkdsvf50azs1jkjd19y-trigger-catalog-naming.drv
cannot build on 'ssh-ng://buildbot-worker@eliza.dos.cit.tum.de': error: failed to start SSH connection to 'eliza.dos.cit.tum.de'
Failed to find a machine for remote build!
derivation: 60wp1zbyrjm6zpkdsvf50azs1jkjd19y-trigger-catalog-naming.drv
required (system, features): (aarch64-linux, [])
1 available machines:
(systems, maxjobs, supportedFeatures, mandatoryFeatures)
([aarch64-linux], 192, [big-parallel, kvm, nixos-test], [])
error: Cannot build '/nix/store/60wp1zbyrjm6zpkdsvf50azs1jkjd19y-trigger-catalog-naming.drv'.
       Reason: platform mismatch
       Required system: 'aarch64-linux'
       Current system: 'x86_64-linux'
failed checks.x86_64-linux.aarch64-generated-control-plugin-routing 0s
aarch64-generated-control-plugin-routing: File "/build/evaluation/test_aarch64_reproducer_evaluation.py", line 13, in <module> from aarch64_reproducer_eva …
aarch64-generated-control-plugin-routing:
  File "/build/evaluation/test_aarch64_reproducer_evaluation.py", line 13, in <module>
    from aarch64_reproducer_evaluation import (
  File "/build/evaluation/aarch64_reproducer_evaluation.py", line 19, in <module>
    from focaccia.completion import TraceCompletion, TraceScope
ModuleNotFoundError: No module named 'focaccia.completion'
----------------------------------------------------------------------
Ran 1 test in 0.000s
FAILED (errors=1)
failed checks.x86_64-linux.aarch64-reproducer-concrete-dependencies 0s
aarch64-reproducer-concrete-dependencies: File "/build/evaluation/test_aarch64_reproducer_evaluation.py", line 13, in <module> from aarch64_reproducer_eva …
aarch64-reproducer-concrete-dependencies:
  File "/build/evaluation/test_aarch64_reproducer_evaluation.py", line 13, in <module>
    from aarch64_reproducer_evaluation import (
  File "/build/evaluation/aarch64_reproducer_evaluation.py", line 19, in <module>
    from focaccia.completion import TraceCompletion, TraceScope
ModuleNotFoundError: No module named 'focaccia.completion'
----------------------------------------------------------------------
Ran 1 test in 0.000s
FAILED (errors=1)
failed checks.x86_64-linux.aarch64-reproducer-entry-context-admission 0s
aarch64-reproducer-entry-context-admission: module = __import__(module_name) ^^^^^^^^^^^^^^^^^^^^^^^ File "/build/evaluation/test_reproducer_ …
aarch64-reproducer-entry-context-admission:
    module = __import__(module_name)
             ^^^^^^^^^^^^^^^^^^^^^^^
  File "/build/evaluation/test_reproducer_evaluation.py", line 10, in <module>
    from focaccia.completion import TraceCompletion, TraceScope
ModuleNotFoundError: No module named 'focaccia.completion'
----------------------------------------------------------------------
Ran 1 test in 0.001s
FAILED (errors=1)
failed checks.x86_64-linux.diagnostic-reproducer-source-admission 0s
diagnostic-reproducer-source-admission: module = __import__(module_name) ^^^^^^^^^^^^^^^^^^^^^^^ File "/build/evaluation/test_reproducer_eval …
diagnostic-reproducer-source-admission:
    module = __import__(module_name)
             ^^^^^^^^^^^^^^^^^^^^^^^
  File "/build/evaluation/test_reproducer_evaluation.py", line 10, in <module>
    from focaccia.completion import TraceCompletion, TraceScope
ModuleNotFoundError: No module named 'focaccia.completion'
----------------------------------------------------------------------
Ran 1 test in 0.000s
FAILED (errors=1)
failed checks.x86_64-linux.reproducer-content-addressed-source-identity 5s
reproducer-effectiveness-evaluation: module = __import__(module_name) ^^^^^^^^^^^^^^^^^^^^^^^ File "/build/evaluation/test_reproducer_evaluat …
reproducer-effectiveness-evaluation:
    module = __import__(module_name)
             ^^^^^^^^^^^^^^^^^^^^^^^
  File "/build/evaluation/test_reproducer_evaluation.py", line 10, in <module>
    from focaccia.completion import TraceCompletion, TraceScope
ModuleNotFoundError: No module named 'focaccia.completion'
----------------------------------------------------------------------
Ran 1 test in 0.000s
FAILED (errors=1)
failed checks.x86_64-linux.reproducer-effectiveness-evaluation 0s
reproducer-effectiveness-evaluation: module = __import__(module_name) ^^^^^^^^^^^^^^^^^^^^^^^ File "/build/evaluation/test_reproducer_evaluat …
reproducer-effectiveness-evaluation:
    module = __import__(module_name)
             ^^^^^^^^^^^^^^^^^^^^^^^
  File "/build/evaluation/test_reproducer_evaluation.py", line 10, in <module>
    from focaccia.completion import TraceCompletion, TraceScope
ModuleNotFoundError: No module named 'focaccia.completion'
----------------------------------------------------------------------
Ran 1 test in 0.000s
FAILED (errors=1)
139 succeeded
succeeded attributes
status attribute duration
loading…
9 already built
skipped attributes
status attribute duration
loading…