nixbot

builds

TUM-DSE/focaccia-eval build #20 failed

branch main · commit e851e226a0 · · took 51s

6 failed
failed attributes
status attribute duration
failed checks.aarch64-linux.reproducer-content-addressed-source-identity 5s
reproducer-effectiveness-evaluation: File "/build/evaluation/test_reproducer_evaluation.py", line 519, in test_configured_reference_outcomes_are_exact_and_rej …
reproducer-effectiveness-evaluation:
  File "/build/evaluation/test_reproducer_evaluation.py", line 519, in test_configured_reference_outcomes_are_exact_and_reject_unrelated_mismatches
    evaluation.require_partial_zmm0_reference(partial, partial_contract)
  File "/build/evaluation/reproducer_evaluation.py", line 980, in require_partial_zmm0_reference
    raise ReproducerEvaluationError(
reproducer_evaluation.ReproducerEvaluationError: Partial reference is not the configured ZMM0-unavailable outcome.
----------------------------------------------------------------------
Ran 24 tests in 0.032s
FAILED (errors=1)
failed checks.aarch64-linux.reproducer-effectiveness-evaluation 0s
reproducer-effectiveness-evaluation: File "/build/evaluation/test_reproducer_evaluation.py", line 519, in test_configured_reference_outcomes_are_exact_and_rej …
reproducer-effectiveness-evaluation:
  File "/build/evaluation/test_reproducer_evaluation.py", line 519, in test_configured_reference_outcomes_are_exact_and_reject_unrelated_mismatches
    evaluation.require_partial_zmm0_reference(partial, partial_contract)
  File "/build/evaluation/reproducer_evaluation.py", line 980, in require_partial_zmm0_reference
    raise ReproducerEvaluationError(
reproducer_evaluation.ReproducerEvaluationError: Partial reference is not the configured ZMM0-unavailable outcome.
----------------------------------------------------------------------
Ran 24 tests in 0.035s
FAILED (errors=1)
failed checks.aarch64-linux.reproducer-reference-outcome-contracts 1s
reproducer-reference-outcome-contracts: File "/build/evaluation/test_reproducer_evaluation.py", line 519, in test_configured_reference_outcomes_are_exact_and_ …
reproducer-reference-outcome-contracts:
  File "/build/evaluation/test_reproducer_evaluation.py", line 519, in test_configured_reference_outcomes_are_exact_and_reject_unrelated_mismatches
    evaluation.require_partial_zmm0_reference(partial, partial_contract)
  File "/build/evaluation/reproducer_evaluation.py", line 980, in require_partial_zmm0_reference
    raise ReproducerEvaluationError(
reproducer_evaluation.ReproducerEvaluationError: Partial reference is not the configured ZMM0-unavailable outcome.
----------------------------------------------------------------------
Ran 1 test in 0.001s
FAILED (errors=1)
failed checks.x86_64-linux.reproducer-content-addressed-source-identity 0s
reproducer-effectiveness-evaluation: File "/build/evaluation/test_reproducer_evaluation.py", line 519, in test_configured_reference_outcomes_are_exact_and_rej …
reproducer-effectiveness-evaluation:
  File "/build/evaluation/test_reproducer_evaluation.py", line 519, in test_configured_reference_outcomes_are_exact_and_reject_unrelated_mismatches
    evaluation.require_partial_zmm0_reference(partial, partial_contract)
  File "/build/evaluation/reproducer_evaluation.py", line 980, in require_partial_zmm0_reference
    raise ReproducerEvaluationError(
reproducer_evaluation.ReproducerEvaluationError: Partial reference is not the configured ZMM0-unavailable outcome.
----------------------------------------------------------------------
Ran 24 tests in 0.052s
FAILED (errors=1)
failed checks.x86_64-linux.reproducer-effectiveness-evaluation 5s
reproducer-effectiveness-evaluation: File "/build/evaluation/test_reproducer_evaluation.py", line 519, in test_configured_reference_outcomes_are_exact_and_rej …
reproducer-effectiveness-evaluation:
  File "/build/evaluation/test_reproducer_evaluation.py", line 519, in test_configured_reference_outcomes_are_exact_and_reject_unrelated_mismatches
    evaluation.require_partial_zmm0_reference(partial, partial_contract)
  File "/build/evaluation/reproducer_evaluation.py", line 980, in require_partial_zmm0_reference
    raise ReproducerEvaluationError(
reproducer_evaluation.ReproducerEvaluationError: Partial reference is not the configured ZMM0-unavailable outcome.
----------------------------------------------------------------------
Ran 24 tests in 0.051s
FAILED (errors=1)
failed checks.x86_64-linux.reproducer-reference-outcome-contracts 0s
reproducer-reference-outcome-contracts: File "/build/evaluation/test_reproducer_evaluation.py", line 519, in test_configured_reference_outcomes_are_exact_and_ …
reproducer-reference-outcome-contracts:
  File "/build/evaluation/test_reproducer_evaluation.py", line 519, in test_configured_reference_outcomes_are_exact_and_reject_unrelated_mismatches
    evaluation.require_partial_zmm0_reference(partial, partial_contract)
  File "/build/evaluation/reproducer_evaluation.py", line 980, in require_partial_zmm0_reference
    raise ReproducerEvaluationError(
reproducer_evaluation.ReproducerEvaluationError: Partial reference is not the configured ZMM0-unavailable outcome.
----------------------------------------------------------------------
Ran 1 test in 0.001s
FAILED (errors=1)
40 succeeded
succeeded attributes
status attribute duration
loading…
143 already built
skipped attributes
status attribute duration
loading…