nixbot

builds

TUM-DSE/focaccia-eval build #25 failed

branch main · commit 2a71ccd232 · · took 1m 44s

3 failed
failed attributes
status attribute duration
failed checks.aarch64-linux.nix-plot-font-discovery 4s
nix-plot-font-discovery: findfont: Font family 'Times New Roman' not found. findfont: Font family 'Times New Roman' not found. findfont: Font family 'Times New …
nix-plot-font-discovery:
findfont: Font family 'Times New Roman' not found.
findfont: Font family 'Times New Roman' not found.
findfont: Font family 'Times New Roman' not found.
figures/combined-bug-study.pdf
figures/timing-accounting.json
Traceback (most recent call last):
  File "<stdin>", line 5, in <module>
AssertionError: ['EVICAO+DejaVuSans-Bold', 'BMQQDV+DejaVuSans']
failed checks.aarch64-linux.whole-run-experiment-execution 0s
setup: this derivation will be built: /nix/store/klz620kw2wm0g2w382wha0grfgfbn95v-whole-run-experiment-execution.drv cannot build on 'ssh-ng://buildbot-worker …
setup:
this derivation will be built:
  /nix/store/klz620kw2wm0g2w382wha0grfgfbn95v-whole-run-experiment-execution.drv
cannot build on 'ssh-ng://buildbot-worker@eliza.dos.cit.tum.de': error: failed to start SSH connection to 'eliza.dos.cit.tum.de'
Failed to find a machine for remote build!
derivation: klz620kw2wm0g2w382wha0grfgfbn95v-whole-run-experiment-execution.drv
required (system, features): (aarch64-linux, [])
1 available machines:
(systems, maxjobs, supportedFeatures, mandatoryFeatures)
([aarch64-linux], 192, [big-parallel, kvm, nixos-test], [])
error: Cannot build '/nix/store/klz620kw2wm0g2w382wha0grfgfbn95v-whole-run-experiment-execution.drv'.
       Reason: platform mismatch
       Required system: 'aarch64-linux'
       Current system: 'x86_64-linux'
failed checks.x86_64-linux.nix-plot-font-discovery 2s
nix-plot-font-discovery: findfont: Font family 'Times New Roman' not found. findfont: Font family 'Times New Roman' not found. findfont: Font family 'Times New …
nix-plot-font-discovery:
findfont: Font family 'Times New Roman' not found.
findfont: Font family 'Times New Roman' not found.
findfont: Font family 'Times New Roman' not found.
figures/combined-bug-study.pdf
figures/timing-accounting.json
Traceback (most recent call last):
  File "<stdin>", line 5, in <module>
AssertionError: ['EVICAO+DejaVuSans-Bold', 'BMQQDV+DejaVuSans']
39 succeeded
succeeded attributes
status attribute duration
loading…
155 already built
skipped attributes
status attribute duration
loading…