nixbot

builds

TUM-DSE/focaccia-eval build #9 failed

branch main · commit a6c823b136 · · took 1m 56s

4 failed
failed attributes
status attribute duration
failed checks.aarch64-linux.exact-trigger-mismatch-localization 0s
setup: this derivation will be built: /nix/store/rkn1qqwg1g01rxn9z7mlwy54gka7cpzv-exact-trigger-mismatch-localization.drv cannot build on 'ssh-ng://buildbot-w …
setup:
this derivation will be built:
  /nix/store/rkn1qqwg1g01rxn9z7mlwy54gka7cpzv-exact-trigger-mismatch-localization.drv
cannot build on 'ssh-ng://buildbot-worker@eliza.dos.cit.tum.de': error: failed to start SSH connection to 'eliza.dos.cit.tum.de'
Failed to find a machine for remote build!
derivation: rkn1qqwg1g01rxn9z7mlwy54gka7cpzv-exact-trigger-mismatch-localization.drv
required (system, features): (aarch64-linux, [])
1 available machines:
(systems, maxjobs, supportedFeatures, mandatoryFeatures)
([aarch64-linux], 192, [big-parallel, kvm, nixos-test], [])
error: Cannot build '/nix/store/rkn1qqwg1g01rxn9z7mlwy54gka7cpzv-exact-trigger-mismatch-localization.drv'.
       Reason: platform mismatch
       Required system: 'aarch64-linux'
       Current system: 'x86_64-linux'
failed checks.aarch64-linux.fatal-diagnostic-eligibility 0s
setup: this derivation will be built: /nix/store/7r0bb38fkvfjii97bsafzjxpiwvnf8av-fatal-diagnostic-eligibility.drv cannot build on 'ssh-ng://buildbot-worker@e …
setup:
this derivation will be built:
  /nix/store/7r0bb38fkvfjii97bsafzjxpiwvnf8av-fatal-diagnostic-eligibility.drv
cannot build on 'ssh-ng://buildbot-worker@eliza.dos.cit.tum.de': error: failed to start SSH connection to 'eliza.dos.cit.tum.de'
Failed to find a machine for remote build!
derivation: 7r0bb38fkvfjii97bsafzjxpiwvnf8av-fatal-diagnostic-eligibility.drv
required (system, features): (aarch64-linux, [])
1 available machines:
(systems, maxjobs, supportedFeatures, mandatoryFeatures)
([aarch64-linux], 192, [big-parallel, kvm, nixos-test], [])
error: Cannot build '/nix/store/7r0bb38fkvfjii97bsafzjxpiwvnf8av-fatal-diagnostic-eligibility.drv'.
       Reason: platform mismatch
       Required system: 'aarch64-linux'
       Current system: 'x86_64-linux'
failed checks.aarch64-linux.plugin-reference-acceptance 0s
setup: this derivation will be built: /nix/store/0v2jaikg9k13smzfd20lzv8n0k9hkk07-plugin-reference-acceptance.drv cannot build on 'ssh-ng://buildbot-worker@el …
setup:
this derivation will be built:
  /nix/store/0v2jaikg9k13smzfd20lzv8n0k9hkk07-plugin-reference-acceptance.drv
cannot build on 'ssh-ng://buildbot-worker@eliza.dos.cit.tum.de': error: failed to start SSH connection to 'eliza.dos.cit.tum.de'
Failed to find a machine for remote build!
derivation: 0v2jaikg9k13smzfd20lzv8n0k9hkk07-plugin-reference-acceptance.drv
required (system, features): (aarch64-linux, [])
1 available machines:
(systems, maxjobs, supportedFeatures, mandatoryFeatures)
([aarch64-linux], 192, [big-parallel, kvm, nixos-test], [])
error: Cannot build '/nix/store/0v2jaikg9k13smzfd20lzv8n0k9hkk07-plugin-reference-acceptance.drv'.
       Reason: platform mismatch
       Required system: 'aarch64-linux'
       Current system: 'x86_64-linux'
failed checks.aarch64-linux.reference-terminal-acceptance 0s
setup: this derivation will be built: /nix/store/703i4vrmvplir94xpv7b1c7s2wl4nh4g-reference-terminal-acceptance.drv cannot build on 'ssh-ng://buildbot-worker@ …
setup:
this derivation will be built:
  /nix/store/703i4vrmvplir94xpv7b1c7s2wl4nh4g-reference-terminal-acceptance.drv
cannot build on 'ssh-ng://buildbot-worker@eliza.dos.cit.tum.de': error: failed to start SSH connection to 'eliza.dos.cit.tum.de'
Failed to find a machine for remote build!
derivation: 703i4vrmvplir94xpv7b1c7s2wl4nh4g-reference-terminal-acceptance.drv
required (system, features): (aarch64-linux, [])
1 available machines:
(systems, maxjobs, supportedFeatures, mandatoryFeatures)
([aarch64-linux], 192, [big-parallel, kvm, nixos-test], [])
error: Cannot build '/nix/store/703i4vrmvplir94xpv7b1c7s2wl4nh4g-reference-terminal-acceptance.drv'.
       Reason: platform mismatch
       Required system: 'aarch64-linux'
       Current system: 'x86_64-linux'
108 succeeded
succeeded attributes
status attribute duration
loading…
69 already built
skipped attributes
status attribute duration
loading…